{"text_format":"1","workbook":"xlsx","n_sheets":3,"sheets":["Sheet1","Sheet2","Sheet3"],"not_rendered":{"charts":0,"images":9,"macros":1,"external_links":0,"defined_names":1,"comments":2,"pivot_tables":0},"unopened":[],"bounds":{"document_bytes":16777216,"sheet_cells":100000,"rows_first":2000,"rows_last":500,"rows_between":2000,"halvings":0,"cell_chars":16384,"cell_head_chars":4096},"cells_cut":0,"cells_raw":0,"read":"whole","date_system":"1900"}

{"sheet":"Sheet1","index":0,"n_rows":102,"n_cols":24,"rows_kept":102,"cut":false,"hidden":false,"merged":[[31,3,31,4],[31,7,31,8],[31,9,31,10],[49,3,49,4],[38,9,38,10],[39,9,39,10],[45,7,45,8],[41,7,41,8],[42,7,42,8],[43,7,43,8],[40,9,40,10],[40,3,40,4],[41,3,41,4],[42,3,42,4],[43,3,43,4],[38,5,38,6],[39,5,39,6],[32,9,32,10],[33,9,33,10],[34,9,34,10],[35,9,35,10],[36,9,36,10],[32,5,32,6],[33,5,33,6],[97,3,97,4],[97,5,97,6],[97,7,97,8],[97,9,97,10],[96,5,96,6],[96,7,96,8],[96,9,96,10],[29,3,29,4],[30,7,30,8],[30,3,30,4],[30,5,30,6],[29,5,29,6],[29,7,29,8],[30,9,30,10],[29,9,29,10],[31,5,31,6],[49,5,49,6],[45,9,45,10],[41,9,41,10],[42,9,42,10],[43,9,43,10],[44,9,44,10],[37,9,37,10],[50,3,50,4],[93,9,93,10],[96,11,96,12],[95,3,95,4],[95,5,95,6],[95,7,95,8],[95,9,95,10],[96,3,96,4],[26,6,26,9],[1,2,1,14],[6,12,24,12],[95,11,95,12],[93,11,93,12],[94,3,94,4],[94,5,94,6],[93,3,93,4],[93,5,93,6],[93,7,93,8],[94,7,94,8],[94,9,94,10],[94,11,94,12],[49,7,49,8],[50,7,50,8],[49,9,49,10],[50,9,50,10],[91,11,91,12],[92,3,92,4],[92,5,92,6],[92,7,92,8],[92,9,92,10],[92,11,92,12],[91,3,91,4],[91,5,91,6],[91,7,91,8],[91,9,91,10],[89,11,89,12],[90,3,90,4],[90,5,90,6],[90,7,90,8],[90,9,90,10],[90,11,90,12],[89,3,89,4],[89,5,89,6],[89,7,89,8],[89,9,89,10],[87,11,87,12],[88,3,88,4],[88,5,88,6],[88,7,88,8],[88,9,88,10],[88,11,88,12],[87,3,87,4],[87,5,87,6],[87,7,87,8],[87,9,87,10],[85,11,85,12],[86,3,86,4],[86,5,86,6],[86,7,86,8],[86,9,86,10],[86,11,86,12],[85,3,85,4],[85,5,85,6],[85,7,85,8],[85,9,85,10],[83,11,83,12],[84,3,84,4],[84,5,84,6],[84,7,84,8],[84,9,84,10],[84,11,84,12],[83,3,83,4],[83,5,83,6],[83,7,83,8],[83,9,83,10],[48,5,48,6],[48,9,48,10],[47,3,47,4],[81,11,81,12],[82,3,82,4],[82,5,82,6],[82,7,82,8],[82,9,82,10],[82,11,82,12],[81,3,81,4],[81,5,81,6],[81,7,81,8],[81,9,81,10],[80,11,80,12],[79,11,79,12],[77,6,77,9],[76,5,76,11],[51,6,51,9],[50,11,50,12],[49,11,49,12],[79,3,79,4],[79,5,79,6],[79,7,79,8],[79,9,79,10],[80,3,80,4],[80,5,80,6],[80,7,80,8],[80,9,80,10],[50,5,50,6],[29,11,29,12],[30,11,30,12],[31,11,31,12],[32,11,32,12],[33,11,33,12],[38,11,38,12],[34,11,34,12],[35,11,35,12],[36,11,36,12],[39,11,39,12],[40,11,40,12],[41,11,41,12],[37,11,37,12],[48,11,48,12],[42,11,42,12],[43,11,43,12],[44,11,44,12],[46,11,46,12],[47,11,47,12],[45,11,45,12],[34,5,34,6],[37,5,37,6],[40,5,40,6],[32,7,32,8],[33,7,33,8],[34,7,34,8],[35,7,35,8],[36,7,36,8],[37,7,37,8],[38,7,38,8],[46,5,46,6],[47,5,47,6],[44,3,44,4],[45,3,45,4],[48,3,48,4],[0,0,3,1],[100,9,100,10],[99,3,99,4],[99,5,99,6],[99,7,99,8],[99,9,99,10],[98,9,98,10],[100,3,100,4],[100,5,100,6],[100,7,100,8],[98,3,98,4],[32,3,32,4],[33,3,33,4],[34,3,34,4],[35,3,35,4],[36,3,36,4],[37,3,37,4],[38,3,38,4],[39,3,39,4],[35,5,35,6],[46,3,46,4],[101,6,101,9],[33,14,33,15],[37,14,37,15],[41,14,41,15],[99,11,99,12],[100,11,100,12],[97,11,97,12],[98,11,98,12],[36,5,36,6],[98,5,98,6],[98,7,98,8],[39,7,39,8],[40,7,40,8],[41,5,41,6],[42,5,42,6],[43,5,43,6],[44,5,44,6],[46,7,46,8],[47,7,47,8],[44,7,44,8],[48,7,48,8],[46,9,46,10],[47,9,47,10],[45,5,45,6]]}
[]
[null,null,"THREE POINT LINEAR REGRESSION TEST FORM",null,null,null,null,null,null,null,null,null,null,null,null,null," ",null," "," "]
[null,null,null,null,null,null,null,null,"SMITH ANALYTICAL, LLC",null,null,null,null,null,null,null,null,"DATE"," "," "]
[null,null,null,null,null,null,null,null,"PO Box 278, Seabrook, Texas, 77586 Office: 281-667-6463"]
["COMPONENT","ANALYZER","COMPONENT",null,"LOW LEVEL CYLINDER",null,null,"MID LEVEL CYLINDER",null,null,"HIGH CYLINDER",null,null,"LOW CYL. ","MID CYL. ","HIGH CYL. ","LOW CYL %","MID CYL. %","HIGH CYL %","LINEAR"]
["NUMBER","NAME","NAME","RUN 1","RUN 2","RUN 3","RUN 1","RUN 2","RUN 3","RUN 1","RUN 2","RUN 3",null,"AVG","AVG","AVG","OF STD.CONC.","OF STD. CONC.","OF STD. CONC . ","REGRESSION"]
[1," "," "," "," "," ","  "," "," "," ","  "," ","  Begin Calculated Fields  ",{"$f":"IF(ISERROR((D7+E7+F7)/3),\"0.000\",(D7+E7+F7)/3)","v":"0.000"},{"$f":"IF(ISERROR((G7+H7+I7)/3),\"0.000\",(G7+H7+I7)/3)","v":"0.000"},{"$f":"IF(ISERROR((J7+K7+L7)/3),\"0.000\",(J7+K7+L7)/3)","v":"0.000"},{"$f":"IF(ISERROR((N7-H32)/H32)*100,\"\",((N7-H32)/H32)*100)","v":""},{"$f":"IF(ISERROR((O7-J32)/J32)*100,\"MUST HAVE \",((O7-J32)/J32)*100)","v":"MUST HAVE "},{"$f":"IF(ISERROR((P7-L32)/L32)*100,\"\",((P7-L32)/L32)*100)","v":""},{"$f":"Sheet2!S5","v":0},null," "]
[2,null," "," "," "," "," "," "," "," "," "," ",null,{"$f":"IF(ISERROR((D8+E8+F8)/3),\"0.000\",(D8+E8+F8)/3)","v":"0.000"},{"$f":"IF(ISERROR((G8+H8+I8)/3),\"0.000\",(G8+H8+I8)/3)","v":"0.000"},{"$f":"IF(ISERROR((J8+K8+L8)/3),\"0.000\",(J8+K8+L8)/3)","v":"0.000"},{"$f":"IF(ISERROR((N8-H33)/H33)*100,\"\",((N8-H33)/H33)*100)","v":""},{"$f":"IF(ISERROR((O8-J33)/J33)*100,\"CYLINDER\",((O8-J33)/J33)*100)","v":"CYLINDER"},{"$f":"IF(ISERROR((P8-L33)/L33)*100,\"\",((P8-L33)/L33)*100)","v":""},{"$f":"Sheet2!S6","v":0}]
[3,null," "," "," "," "," "," "," "," "," "," ",null,{"$f":"IF(ISERROR((D9+E9+F9)/3),\"0.000\",(D9+E9+F9)/3)","v":"0.000"},"0.000","0.000",{"$f":"IF(ISERROR((N9-H34)/H34)*100,\"\",((N9-H34)/H34)*100)","v":""},{"$f":"IF(ISERROR((O9-J34)/J34)*100,\"STANDARD\",((O9-J34)/J34)*100)","v":"STANDARD"},"",{"$f":"Sheet2!S7","v":0}]
[4,null," "," "," "," "," "," "," "," "," "," ",null,{"$f":"IF(ISERROR((D10+E10+F10)/3),\"0.000\",(D10+E10+F10)/3)","v":"0.000"},"0.000","0.000","",{"$f":"IF(ISERROR((O10-J35)/J35)*100,\"CONC.\",((O10-J35)/J35)*100)","v":"CONC."},"",{"$f":"Sheet2!S8","v":0}]
[5,null," ",null,null,null,null,null,null,null,null,null,null,{"$f":"IF(ISERROR((D11+E11+F11)/3),\"0.000\",(D11+E11+F11)/3)","v":0},0,0,"",{"$f":"IF(ISERROR((O11-J36)/J36)*100,\"VALUES\",((O11-J36)/J36)*100)","v":"VALUES"},"",{"$f":"Sheet2!S9","v":0},null," ",null," "]
[6,null," ",null,null,null,null,null,null,null,null,null,null,{"$f":"IF(ISERROR((D12+E12+F12)/3),\"0.000\",(D12+E12+F12)/3)","v":0},0,0,"",{"$f":"IF(ISERROR((O12-J37)/J37)*100,\"TO FILL IN\",((O12-J37)/J37)*100)","v":"TO FILL IN"},"",{"$f":"Sheet2!S10","v":0},null," "]
[7,null," ",null,null,null,null,null,null,null,null,null,null,0,0,0,"",{"$f":"IF(ISERROR((O13-J38)/J38)*100,\"THESE\",((O13-J38)/J38)*100)","v":"THESE"},"",{"$f":"Sheet2!S11","v":0}]
[8,null," ",null,null,null,null,null,null,null,null,null,null,0,0,0,"",{"$f":"IF(ISERROR((O14-J39)/J39)*100,\"FIELDS\",((O14-J39)/J39)*100)","v":"FIELDS"},"",{"$f":"Sheet2!S12","v":0}]
[9,null," ",null,null,null,null,null,null,null,null,null,null,0,0,0,"",{"$f":"IF(ISERROR((O15-J40)/J40)*100,\"\",((O15-J40)/J40)*100)","v":""},"",{"$f":"Sheet2!S13","v":0}]
[10,null," ",null,null,null,null,null,null,null,null,null,null,0,0,0,"",{"$f":"IF(ISERROR((O16-J41)/J41)*100,\"\",((O16-J41)/J41)*100)","v":""},"",{"$f":"Sheet2!S14","v":0}]
[11,null," ",null,null,null,null,null,null,null,null,null,null,0,0,0,"","","",{"$f":"Sheet2!S15","v":0},null," "]
[12,null," ",null,null,null,null,null,null,null,null,null,null,0,0,0,"","","",{"$f":"Sheet2!S16","v":0}]
[13,null," ",null,null,null,null,null,null,null,null,null,null,0,0,0,"","","",{"$f":"Sheet2!S17","v":0}]
[14,null," ",null,null,null,null,null,null,null,null,null,null,0,0,0,"","","",{"$f":"Sheet2!S18","v":0}]
[15,null," ",null,null,null,null,null,null,null,null,null,null,0,0,0,"","","",{"$f":"Sheet2!S19","v":0}]
[16,null," ",null,null,null,null,null,null,null,null,null,null,0,0,0,"","","",{"$f":"Sheet2!S20","v":0}]
[17,null," ",null,null,null,null,null,null,null,null,null,null,0,0,0,"","","",{"$f":"Sheet2!S21","v":0}]
[18,null," ",null,null,null,null,null,null,null,null,null,null,0,0,0,"","","",{"$f":"Sheet2!S22","v":0}]
[19,null," ",null,null,null,null,null,null,null,null,null,null,0,0,0,{"$f":"IF(ISERROR((N25-H50)/H50)*100,\"\",((N25-H50)/H50)*100)","v":""},"","",{"$f":"Sheet2!S23","v":0}]
[20,null," ",null,null,null,null,null,null,null,null,null,null,0,0,0,"","","",{"$f":"Sheet2!S24","v":0}]
[null,null,null,null,null,null,"ANALYZER AUDIT DATA"]
[]
[" "," "]
[null,null," ","COMPONENT",null,"COMPONENT ",null,"STD. CONC. ",null,"STD. CONC.",null,"STD. CONC. "]
[null,null," ","NUMBER",null,"NAME",null,"LOW CYLINDER",null,"MID CYLINDER",null,"HIGH RANGE"]
[null,null,null,1,null,{"$f":"C7","v":" "},null," ",null," ",null," "]
[null,null,null,2,null,{"$f":"C8","v":" "},{"$f":"IF(ISERROR((D33-#REF!)/#REF!)*100,\"\",((D33-#REF!)/#REF!)*100)","v":""}," ",null," ",null," "]
[null,null,null,3,null,{"$f":"C9","v":" "},null," ",null," ",null," ",null," ","LOW RANGE CYLINDER"]
[null,null,null,4,null," ",null," ",null," ",null," ",null,null,"CYL. NUMBER","EXP. DATE"]
[null,null,null,5,null,{"$f":"C11","v":" "},null,null,null,null,null,null,null,null," "," "]
[null,null,null,6,null," ",null,null,null,null,null,null,null,null,null," "]
[null,null,null,7,null,{"$f":"C13","v":" "},null,null,null,null,null,null,null,null,"MID RANGE CYLINDER"]
[null,null,null,8,null," ",null,null,null,null,null,null,null,null,"CYL. NUMBER","EXP. DATE"]
[null,null,null,9,null," ",null,null,null,null,null,null,null,null," "," "]
[null,null,null,10,null," "]
[null,null,null,11,null," ",null,null,null,null,null,null,null,null,"HIGH RANGE CYLINDER"]
[null,null,null,12,null," ",null,null,null,null,null,null,null,null,"NUMBER","EXP. DATE"]
[null,null,null,13,null," ",null,null,null,null,null,null,null,null," "," "]
[null,null,null,14,null," "]
[null,null,null,15,null," "]
[null,null,null,16,null," "]
[null,null,null,17,null," "]
[null,null,null,18,null," "]
[null,null,null,19,null," "]
[null,null,null,20,null," "]
[null,null,null,null,null,null,"ANALYZER CYLINDER DATA"]
[null,null,null,null,null,null,null,null,null,null,null,null,null,null," "]
[null,null,null,null,null,null,null,null,null," "]
["COMPONENT","ANALYZER","COMPONENT",null,"LOW LEVEL CYLINDER",null,null,"MID LEVEL CYLINDER",null,null,"HIGH CYLINDER"]
["NUMBER","NAME","NAME","RUN 1","RUN 2","RUN 3","RUN 1","RUN 2","RUN 3","RUN 1","RUN 2","RUN 3"]
[1,{"$f":"B7","v":" "},{"$f":"C7","v":" "},{"$f":"IF(ISERROR(ABS((D7-N7)/N7)*100),\"\",ABS((D7-N7)/N7)*100)","v":""},{"$f":"IF(ISERROR(ABS((E7-N7)/N7)*100),\"\",ABS((E7-N7)/N7)*100)","v":""},{"$f":"IF(ISERROR(ABS((F7-N7)/N7)*100),\"\",ABS((F7-N7)/N7)*100)","v":""},{"$f":"IF(ISERROR(ABS((G7-O7)/O7)*100),\"\",ABS((G7-O7)/O7)*100)","v":""},{"$f":"IF(ISERROR(ABS((H7-O7)/O7)*100),\"\",ABS((H7-O7)/O7)*100)","v":""},{"$f":"IF(ISERROR(ABS((I7-O7)/O7)*100),\"\",ABS((I7-O7)/O7)*100)","v":""},{"$f":"IF(ISERROR(ABS((J7-P7)/P7)*100),\"\",ABS((J7-P7)/P7)*100)","v":""},{"$f":"IF(ISERROR(ABS((K7-P7)/P7)*100),\"\",ABS((K7-P7)/P7)*100)","v":""},{"$f":"IF(ISERROR(ABS((L7-P7)/P7)*100),\"\",ABS((L7-P7)/P7)*100)","v":""}]
[2," ",{"$f":"C8","v":" "},{"$f":"IF(ISERROR(ABS((D8-N8)/N8)*100),\"\",ABS((D8-N8)/N8)*100)","v":""},{"$f":"IF(ISERROR(ABS((E8-N8)/N8)*100),\"\",ABS((E8-N8)/N8)*100)","v":""},{"$f":"IF(ISERROR(ABS((F8-N8)/N8)*100),\"\",ABS((F8-N8)/N8)*100)","v":""},{"$f":"IF(ISERROR(ABS((G8-O8)/O8)*100),\"\",ABS((G8-O8)/O8)*100)","v":""},{"$f":"IF(ISERROR(ABS((H8-O8)/O8)*100),\"\",ABS((H8-O8)/O8)*100)","v":""},{"$f":"IF(ISERROR(ABS((I8-O8)/O8)*100),\"\",ABS((I8-O8)/O8)*100)","v":""},{"$f":"IF(ISERROR(ABS((J8-P8)/P8)*100),\"\",ABS((J8-P8)/P8)*100)","v":""},{"$f":"IF(ISERROR(ABS((K8-P8)/P8)*100),\"\",ABS((K8-P8)/P8)*100)","v":""},{"$f":"IF(ISERROR(ABS((L8-P8)/P8)*100),\"\",ABS((L8-P8)/P8)*100)","v":""}]
[3," ",{"$f":"C9","v":" "},"",{"$f":"IF(ISERROR(ABS((E9-N9)/N9)*100),\"\",ABS((E9-N9)/N9)*100)","v":""},{"$f":"IF(ISERROR(ABS((F9-N9)/N9)*100),\"\",ABS((F9-N9)/N9)*100)","v":""},{"$f":"IF(ISERROR(ABS((G9-O9)/O9)*100),\"\",ABS((G9-O9)/O9)*100)","v":""},{"$f":"IF(ISERROR(ABS((H9-O9)/O9)*100),\"\",ABS((H9-O9)/O9)*100)","v":""},{"$f":"IF(ISERROR(ABS((I9-O9)/O9)*100),\"\",ABS((I9-O9)/O9)*100)","v":""},"","",""]
[4," ",{"$f":"C10","v":" "},"","","","","","","","",""]
[5," "," ","","","","","","","","",""]
[6," "," ","","","","","","","","",""]
[7," "," ","","","","","","","","",""]
[8,null," ","","","","","","","","",""]
[9,null," ","","","","","","","","",""]
[10,null," ","","","","","","","","",""]
[11," "," ","","","","","","","","",""]
[12,null," ","","","","","","","","",""]
[13,null," ","","","","","","","","",""]
[14,null," ","","","","","","","","",""]
[15,null," ","","","","","","","","",""]
[16,null," ","","","","","","","","",""]
[17,null," ","","","","","","","","",""]
[18,null," ","","","","","","","","",""]
[19,null," ","","","","","","","","",""]
[20,null," ","","","","","","","","",""]
[null,null,null,null,null,"ANALYZER PRECISION DATA (% ERROR)"]
[]
[]
[null,null,null,"COMPONENT",null,"COMPONENT ",null,"PASS-FAIL",null,"PASS-FAIL ",null,"PASS-FAIL",null,"PASS-FAIL"]
[null,null,null,"NUMBER",null,"NAME",null,"LOW RANGE",null,"MID RANGE",null,"HIGH RANGE",null,"LINEAR REG. "]
[null,null,null,1,null,{"$f":"C7","v":" "},null,{"$f":"IF(AND(Q7>-10,Q7<10),IF(MAX(D57:F57)<5,\"PASS\",\"FAIL\"))","v":false},{"$f":"IF(AND(I53>-10,I53<10),\"PASS\",\"FAIL\")","v":"PASS"},{"$f":"IF(AND(R7>-10,R7<10),IF(MAX(G57:I57)<5,\"PASS\",\"FAIL\"))","v":false},{"$f":"IF(AND(K53>-10,K53<10),\"PASS\",\"FAIL\")","v":"PASS"},{"$f":"IF(AND(S7>-10,S7<10),IF(MAX(J57:L57)<5,\"PASS\",\"FAIL\"))","v":false},{"$f":"IF(AND(M53>-10,M53<10),\"PASS\",\"FAIL\")","v":"PASS"},{"$f":"IF(T7 > 0.995,\"PASS\",\"FAIL\")","v":"FAIL"}," "]
[null,null,null,2,null,{"$f":"C8","v":" "},null,{"$f":"IF(AND(Q8>-10,Q8<10),IF(MAX(D58:F58)<5,\"PASS\",\"FAIL\"))","v":false},{"$f":"IF(AND(I54>-10,I54<10),\"PASS\",\"FAIL\")","v":"PASS"},{"$f":"IF(AND(R8>-10,R8<10),IF(MAX(G58:I58)<5,\"PASS\",\"FAIL\"))","v":false},{"$f":"IF(AND(K54>-10,K54<10),\"PASS\",\"FAIL\")","v":"PASS"},{"$f":"IF(AND(S8>-10,S8<10),IF(MAX(J58:L58)<5,\"PASS\",\"FAIL\"))","v":false},{"$f":"IF(AND(M54>-10,M54<10),\"PASS\",\"FAIL\")","v":"PASS"},{"$f":"IF(T8 > 0.995,\"PASS\",\"FAIL\")","v":"FAIL"}]
[null,null,null,3,null," ",null,false,"PASS",{"$f":"IF(AND(R9>-10,R9<10),IF(MAX(G59:I59)<5,\"PASS\",\"FAIL\"))","v":false},{"$f":"IF(AND(K55>-10,K55<10),\"PASS\",\"FAIL\")","v":"FAIL"},false,"PASS","FAIL"]
[null,null,null,4,null," ",null,false,"FAIL",false,"FAIL",false,"PASS","FAIL"," "]
[null,null,null,5,null," ",null,false,"FAIL",false,"FAIL",false,"PASS","FAIL"]
[null,null,null,6,null," ",null,false,"FAIL",false,"FAIL",false,"PASS","FAIL"]
[null,null,null,7,null," ",null,false,"FAIL",false,"FAIL",false,"PASS","FAIL"]
[null,null,null,8,null," ",null,false,"FAIL",false,"FAIL",false,"PASS","FAIL"]
[null,null,null,9,null," ",null,false,"FAIL",false,"FAIL",false,"PASS","FAIL"]
[null,null,null,10,null," ",null,false,"FAIL",false,"FAIL",false,"PASS","FAIL"]
[null,null,null,11,null," ",null,false,"FAIL",false,"FAIL",false,"PASS","FAIL"]
[null,null,null,12,null," ",null,false,"FAIL",false,"FAIL",false,"PASS","FAIL"]
[null,null,null,13,null," ",null,false,"FAIL",false,"FAIL",false,"PASS","FAIL"]
[null,null,null,14,null," ",null,false,"FAIL",false,"FAIL",false,"PASS","FAIL"]
[null,null,null,15,null," ",null,false,"FAIL",false,"FAIL",false,"PASS","FAIL"]
[null,null,null,16,null," ",null,false,"FAIL",false,"FAIL",false,"PASS","FAIL"]
[null,null,null,17,null," ",null,false,"FAIL",false,"FAIL",false,"PASS","FAIL"]
[null,null,null,18,null," ",null,false,"FAIL",false,"FAIL",false,"PASS","FAIL"]
[null,null,null,19,null," ",null,false,"FAIL",false,"FAIL",false,"PASS","FAIL"]
[null,null,null,20,null," ",null,false,"FAIL",false,"FAIL",false,"PASS","FAIL"]
[null,null,null,null,null,null,"PASS-FAIL ANALYSIS"]

{"sheet":"Sheet2","index":1,"n_rows":50,"n_cols":20,"rows_kept":50,"cut":false,"hidden":false,"merged":[[2,0,2,1]]}
[null,null," "]
["MEAS.PTS:",3,"Column note","Column Note","Column Note","Column Note","Column Note","Column Note","Column Note","Column Note","Column Note","Column Note","Column Note","Column Note","Column Note","Column Note","Column Note","Column Note","Column Note"]
["COMPONENTS",null,"X1Y1 + X2Y2 + X3Y3","C3 * 3","X1 + X2 + X3","Y1+Y2+Y3","D3 - (E3*F3)","Y1^2+Y2^2+Y3^2","H3 * 3","(Y1+Y2+Y3)^2","X1^2+X2^2+X3^2","K3*3","(X1+X2+X3)^2","I3 - J3","L3 - M3","N3 * O3","sqrt(P3)","G3 / Q3","R3^2"]
["NUMBER","NAME",null,null,null," "]
[1,{"$f":"Sheet1!C7","v":" "},{"$f":"(Sheet1!N7*Sheet1!H32) + (Sheet1!O7*Sheet1!J32) + (Sheet1!P7*Sheet1!L32)","v":{"$error":"#VALUE!"}},{"$f":"C5*B2","v":{"$error":"#VALUE!"}},{"$f":"Sheet1!N7 + Sheet1!O7 + Sheet1!P7","v":0},{"$f":"Sheet1!H32+Sheet1!J32+Sheet1!L32","v":{"$error":"#VALUE!"}},{"$f":"IF(ISERROR(D5-(E5*F5)),\"0\",D5-(E5*F5))","v":"0"},{"$f":"Sheet1!H32^2+Sheet1!J32^2+Sheet1!L32^2","v":{"$error":"#VALUE!"}},{"$f":"H5*B2","v":{"$error":"#VALUE!"}},{"$f":"(Sheet1!H32 + Sheet1!J32+Sheet1!L32)^2","v":{"$error":"#VALUE!"}},{"$f":"Sheet1!N7^2+Sheet1!O7^2+Sheet1!P7^2","v":0},{"$f":"K5*B2","v":0},{"$f":"(Sheet1!N7 + Sheet1!O7+Sheet1!P7)^2","v":0},{"$f":"I5-J5","v":{"$error":"#VALUE!"}},{"$f":"L5-M5","v":0},{"$f":"N5*O5","v":{"$error":"#VALUE!"}},{"$f":"SQRT(P5)","v":{"$error":"#VALUE!"}},{"$f":"IF(ISERROR(G5/Q5),\"0\",G5/Q5)","v":"0"},{"$f":"R5^2","v":0}]
[2,{"$f":"Sheet1!C8","v":" "},{"$f":"(Sheet1!N8*Sheet1!H33) + (Sheet1!O8*Sheet1!J33) + (Sheet1!P8*Sheet1!L33)","v":{"$error":"#VALUE!"}},{"$f":"C6*B2","v":{"$error":"#VALUE!"}},{"$f":"Sheet1!N8 + Sheet1!O8 + Sheet1!P8","v":0},{"$f":"Sheet1!H33+Sheet1!J33+Sheet1!L33","v":{"$error":"#VALUE!"}},{"$f":"IF(ISERROR(D6-(E6*F6)),\"0\",D6-(E6*F6))","v":"0"},{"$f":"Sheet1!H33^2+Sheet1!J33^2+Sheet1!L33^2","v":{"$error":"#VALUE!"}},{"$f":"H6*B2","v":{"$error":"#VALUE!"}},{"$f":"(Sheet1!H33 + Sheet1!J33+Sheet1!L33)^2","v":{"$error":"#VALUE!"}},{"$f":"Sheet1!N8^2+Sheet1!O8^2+Sheet1!P8^2","v":0},{"$f":"K6*B2","v":0},{"$f":"(Sheet1!N8 + Sheet1!O8+Sheet1!P8)^2","v":0},{"$f":"I6-J6","v":{"$error":"#VALUE!"}},{"$f":"L6-M6","v":0},{"$f":"N6*O6","v":{"$error":"#VALUE!"}},{"$f":"SQRT(P6)","v":{"$error":"#VALUE!"}},{"$f":"IF(ISERROR(G6/Q6),\"0\",G6/Q6)","v":"0"},{"$f":"R6^2","v":0}]
[3,{"$f":"Sheet1!C9","v":" "},{"$f":"(Sheet1!N9*Sheet1!H34) + (Sheet1!O9*Sheet1!J34) + (Sheet1!P9*Sheet1!L34)","v":{"$error":"#VALUE!"}},{"$f":"C7*B2","v":{"$error":"#VALUE!"}},{"$f":"Sheet1!N9 + Sheet1!O9 + Sheet1!P9","v":0},{"$f":"Sheet1!H34+Sheet1!J34+Sheet1!L34","v":{"$error":"#VALUE!"}},"0",{"$f":"Sheet1!H34^2+Sheet1!J34^2+Sheet1!L34^2","v":{"$error":"#VALUE!"}},{"$f":"H7*B2","v":{"$error":"#VALUE!"}},{"$f":"(Sheet1!H34 + Sheet1!J34+Sheet1!L34)^2","v":{"$error":"#VALUE!"}},{"$f":"Sheet1!N9^2+Sheet1!O9^2+Sheet1!P9^2","v":0},{"$f":"K7*B2","v":0},{"$f":"(Sheet1!N9 + Sheet1!O9+Sheet1!P9)^2","v":0},{"$error":"#VALUE!"},0,{"$error":"#VALUE!"},{"$error":"#VALUE!"},"0",0]
[4,{"$f":"Sheet1!C10","v":" "},{"$f":"(Sheet1!N10*Sheet1!H35) + (Sheet1!O10*Sheet1!J35) + (Sheet1!P10*Sheet1!L35)","v":{"$error":"#VALUE!"}},{"$f":"C8*B2","v":{"$error":"#VALUE!"}},{"$f":"Sheet1!N10 + Sheet1!O10 + Sheet1!P10","v":0},{"$f":"Sheet1!H35+Sheet1!J35+Sheet1!L35","v":{"$error":"#VALUE!"}},"0",{"$f":"Sheet1!H35^2+Sheet1!J35^2+Sheet1!L35^2","v":{"$error":"#VALUE!"}},{"$f":"H8*B2","v":{"$error":"#VALUE!"}},{"$f":"(Sheet1!H35 + Sheet1!J35+Sheet1!L35)^2","v":{"$error":"#VALUE!"}},{"$f":"Sheet1!N10^2+Sheet1!O10^2+Sheet1!P10^2","v":0},{"$f":"K8*B2","v":0},{"$f":"(Sheet1!N10 + Sheet1!O10+Sheet1!P10)^2","v":0},{"$error":"#VALUE!"},0,{"$error":"#VALUE!"},{"$error":"#VALUE!"},"0",0]
[5,{"$f":"Sheet1!C11","v":" "},{"$f":"(Sheet1!N11*Sheet1!H36) + (Sheet1!O11*Sheet1!J36) + (Sheet1!P11*Sheet1!L36)","v":0},{"$f":"C9*B2","v":0},{"$f":"Sheet1!N11 + Sheet1!O11 + Sheet1!P11","v":0},{"$f":"Sheet1!H36+Sheet1!J36+Sheet1!L36","v":0},0,{"$f":"Sheet1!H36^2+Sheet1!J36^2+Sheet1!L36^2","v":0},{"$f":"H9*B2","v":0},{"$f":"(Sheet1!H36 + Sheet1!J36+Sheet1!L36)^2","v":0},{"$f":"Sheet1!N11^2+Sheet1!O11^2+Sheet1!P11^2","v":0},{"$f":"K9*B2","v":0},{"$f":"(Sheet1!N11 + Sheet1!O11+Sheet1!P11)^2","v":0},0,0,0,0,"0",0]
[6,{"$f":"Sheet1!C12","v":" "},{"$f":"(Sheet1!N12*Sheet1!H37) + (Sheet1!O12*Sheet1!J37) + (Sheet1!P12*Sheet1!L37)","v":0},{"$f":"C10*B2","v":0},{"$f":"Sheet1!N12 + Sheet1!O12 + Sheet1!P12","v":0},{"$f":"Sheet1!H37+Sheet1!J37+Sheet1!L37","v":0},0,{"$f":"Sheet1!H37^2+Sheet1!J37^2+Sheet1!L37^2","v":0},{"$f":"H10*B2","v":0},{"$f":"(Sheet1!H37 + Sheet1!J37+Sheet1!L37)^2","v":0},{"$f":"Sheet1!N12^2+Sheet1!O12^2+Sheet1!P12^2","v":0},{"$f":"K10*B2","v":0},{"$f":"(Sheet1!N12 + Sheet1!O12+Sheet1!P12)^2","v":0},0,0,0,0,"0",0]
[7,{"$f":"Sheet1!C13","v":" "},{"$f":"(Sheet1!N13*Sheet1!H38) + (Sheet1!O13*Sheet1!J38) + (Sheet1!P13*Sheet1!L38)","v":0},{"$f":"C11*B2","v":0},{"$f":"Sheet1!N13 + Sheet1!O13 + Sheet1!P13","v":0},{"$f":"Sheet1!H38+Sheet1!J38+Sheet1!L38","v":0},0,{"$f":"Sheet1!H38^2+Sheet1!J38^2+Sheet1!L38^2","v":0},{"$f":"H11*B2","v":0},{"$f":"(Sheet1!H38 + Sheet1!J38+Sheet1!L38)^2","v":0},{"$f":"Sheet1!N13^2+Sheet1!O13^2+Sheet1!P13^2","v":0},{"$f":"K11*B2","v":0},{"$f":"(Sheet1!N13 + Sheet1!O13+Sheet1!P13)^2","v":0},0,0,0,0,"0",0]
[8,{"$f":"Sheet1!C14","v":" "},{"$f":"(Sheet1!N14*Sheet1!H39) + (Sheet1!O14*Sheet1!J39) + (Sheet1!P14*Sheet1!L39)","v":0},{"$f":"C12*B2","v":0},{"$f":"Sheet1!N14 + Sheet1!O14 + Sheet1!P14","v":0},{"$f":"Sheet1!H39+Sheet1!J39+Sheet1!L39","v":0},0,{"$f":"Sheet1!H39^2+Sheet1!J39^2+Sheet1!L39^2","v":0},{"$f":"H12*B2","v":0},{"$f":"(Sheet1!H39 + Sheet1!J39+Sheet1!L39)^2","v":0},{"$f":"Sheet1!N14^2+Sheet1!O14^2+Sheet1!P14^2","v":0},{"$f":"K12*B2","v":0},{"$f":"(Sheet1!N14 + Sheet1!O14+Sheet1!P14)^2","v":0},0,0,0,0,"0",0]
[9,{"$f":"Sheet1!C15","v":" "},{"$f":"(Sheet1!N15*Sheet1!H40) + (Sheet1!O15*Sheet1!J40) + (Sheet1!P15*Sheet1!L40)","v":0},{"$f":"C13*B2","v":0},{"$f":"Sheet1!N15 + Sheet1!O15 + Sheet1!P15","v":0},{"$f":"Sheet1!H40+Sheet1!J40+Sheet1!L40","v":0},0,{"$f":"Sheet1!H40^2+Sheet1!J40^2+Sheet1!L40^2","v":0},{"$f":"H13*B2","v":0},{"$f":"(Sheet1!H40 + Sheet1!J40+Sheet1!L40)^2","v":0},{"$f":"Sheet1!N15^2+Sheet1!O15^2+Sheet1!P15^2","v":0},{"$f":"K13*B2","v":0},{"$f":"(Sheet1!N15 + Sheet1!O15+Sheet1!P15)^2","v":0},0,0,0,0,"0",0]
[10,{"$f":"Sheet1!C16","v":" "},{"$f":"(Sheet1!N16*Sheet1!H41) + (Sheet1!O16*Sheet1!J41) + (Sheet1!P16*Sheet1!L41)","v":0},{"$f":"C14*B2","v":0},{"$f":"Sheet1!N16 + Sheet1!O16 + Sheet1!P16","v":0},{"$f":"Sheet1!H41+Sheet1!J41+Sheet1!L41","v":0},0,{"$f":"Sheet1!H41^2+Sheet1!J41^2+Sheet1!L41^2","v":0},{"$f":"H14*B2","v":0},{"$f":"(Sheet1!H41 + Sheet1!J41+Sheet1!L41)^2","v":0},{"$f":"Sheet1!N16^2+Sheet1!O16^2+Sheet1!P16^2","v":0},{"$f":"K14*B2","v":0},{"$f":"(Sheet1!N16 + Sheet1!O16+Sheet1!P16)^2","v":0},0,0,0,0,"0",0]
[11,{"$f":"Sheet1!C17","v":" "},{"$f":"(Sheet1!N17*Sheet1!H42) + (Sheet1!O17*Sheet1!J42) + (Sheet1!P17*Sheet1!L42)","v":0},{"$f":"C15*B2","v":0},{"$f":"Sheet1!N17 + Sheet1!O17 + Sheet1!P17","v":0},{"$f":"Sheet1!H42+Sheet1!J42+Sheet1!L42","v":0},0,{"$f":"Sheet1!H42^2+Sheet1!J42^2+Sheet1!L42^2","v":0},{"$f":"H15*B2","v":0},{"$f":"(Sheet1!H42 + Sheet1!J42+Sheet1!L42)^2","v":0},{"$f":"Sheet1!N17^2+Sheet1!O17^2+Sheet1!P17^2","v":0},{"$f":"K15*B2","v":0},{"$f":"(Sheet1!N17 + Sheet1!O17+Sheet1!P17)^2","v":0},0,0,0,0,"0",0]
[12,{"$f":"Sheet1!C18","v":" "},{"$f":"(Sheet1!N18*Sheet1!H43) + (Sheet1!O18*Sheet1!J43) + (Sheet1!P18*Sheet1!L43)","v":0},{"$f":"C16*B2","v":0},{"$f":"Sheet1!N18 + Sheet1!O18 + Sheet1!P18","v":0},{"$f":"Sheet1!H43+Sheet1!J43+Sheet1!L43","v":0},0,{"$f":"Sheet1!H43^2+Sheet1!J43^2+Sheet1!L43^2","v":0},{"$f":"H16*B2","v":0},{"$f":"(Sheet1!H43 + Sheet1!J43+Sheet1!L43)^2","v":0},{"$f":"Sheet1!N18^2+Sheet1!O18^2+Sheet1!P18^2","v":0},{"$f":"K16*B2","v":0},{"$f":"(Sheet1!N18 + Sheet1!O18+Sheet1!P18)^2","v":0},0,0,0,0,"0",0]
[13,{"$f":"Sheet1!C19","v":" "},{"$f":"(Sheet1!N19*Sheet1!H44) + (Sheet1!O19*Sheet1!J44) + (Sheet1!P19*Sheet1!L44)","v":0},{"$f":"C17*B2","v":0},{"$f":"Sheet1!N19 + Sheet1!O19 + Sheet1!P19","v":0},{"$f":"Sheet1!H44+Sheet1!J44+Sheet1!L44","v":0},0,{"$f":"Sheet1!H44^2+Sheet1!J44^2+Sheet1!L44^2","v":0},{"$f":"H17*B2","v":0},{"$f":"(Sheet1!H44 + Sheet1!J44+Sheet1!L44)^2","v":0},{"$f":"Sheet1!N19^2+Sheet1!O19^2+Sheet1!P19^2","v":0},{"$f":"K17*B2","v":0},{"$f":"(Sheet1!N19 + Sheet1!O19+Sheet1!P19)^2","v":0},0,0,0,0,"0",0]
[14,{"$f":"Sheet1!C20","v":" "},{"$f":"(Sheet1!N20*Sheet1!H45) + (Sheet1!O20*Sheet1!J45) + (Sheet1!P20*Sheet1!L45)","v":0},{"$f":"C18*B2","v":0},{"$f":"Sheet1!N20 + Sheet1!O20 + Sheet1!P20","v":0},{"$f":"Sheet1!H45+Sheet1!J45+Sheet1!L45","v":0},0,{"$f":"Sheet1!H45^2+Sheet1!J45^2+Sheet1!L45^2","v":0},{"$f":"H18*B2","v":0},{"$f":"(Sheet1!H45 + Sheet1!J45+Sheet1!L45)^2","v":0},{"$f":"Sheet1!N20^2+Sheet1!O20^2+Sheet1!P20^2","v":0},{"$f":"K18*B2","v":0},{"$f":"(Sheet1!N20 + Sheet1!O20+Sheet1!P20)^2","v":0},0,0,0,0,"0",0," "]
[15,{"$f":"Sheet1!C21","v":" "},{"$f":"(Sheet1!N21*Sheet1!H46) + (Sheet1!O21*Sheet1!J46) + (Sheet1!P21*Sheet1!L46)","v":0},{"$f":"C19*B2","v":0},{"$f":"Sheet1!N21 + Sheet1!O21 + Sheet1!P21","v":0},{"$f":"Sheet1!H46+Sheet1!J46+Sheet1!L46","v":0},0,{"$f":"Sheet1!H46^2+Sheet1!J46^2+Sheet1!L46^2","v":0},{"$f":"H19*B2","v":0},{"$f":"(Sheet1!H46 + Sheet1!J46+Sheet1!L46)^2","v":0},{"$f":"Sheet1!N21^2+Sheet1!O21^2+Sheet1!P21^2","v":0},{"$f":"K19*B2","v":0},{"$f":"(Sheet1!N21 + Sheet1!O21+Sheet1!P21)^2","v":0},0,0,0,0,"0",0]
[16,{"$f":"Sheet1!C22","v":" "},{"$f":"(Sheet1!N22*Sheet1!H47) + (Sheet1!O22*Sheet1!J47) + (Sheet1!P22*Sheet1!L47)","v":0},{"$f":"C20*B2","v":0},{"$f":"Sheet1!N22 + Sheet1!O22 + Sheet1!P22","v":0},{"$f":"Sheet1!H47+Sheet1!J47+Sheet1!L47","v":0},0,{"$f":"Sheet1!H47^2+Sheet1!J47^2+Sheet1!L47^2","v":0},{"$f":"H20*B2","v":0},{"$f":"(Sheet1!H47 + Sheet1!J47+Sheet1!L47)^2","v":0},{"$f":"Sheet1!N22^2+Sheet1!O22^2+Sheet1!P22^2","v":0},{"$f":"K20*B2","v":0},{"$f":"(Sheet1!N22 + Sheet1!O22+Sheet1!P22)^2","v":0},0,0,0,0,"0",0]
[17,{"$f":"Sheet1!C23","v":" "},{"$f":"(Sheet1!N23*Sheet1!H48) + (Sheet1!O23*Sheet1!J48) + (Sheet1!P23*Sheet1!L48)","v":0},{"$f":"C21*B2","v":0},{"$f":"Sheet1!N23 + Sheet1!O23 + Sheet1!P23","v":0},{"$f":"Sheet1!H48+Sheet1!J48+Sheet1!L48","v":0},0,{"$f":"Sheet1!H48^2+Sheet1!J48^2+Sheet1!L48^2","v":0},{"$f":"H21*B2","v":0},{"$f":"(Sheet1!H48 + Sheet1!J48+Sheet1!L48)^2","v":0},{"$f":"Sheet1!N23^2+Sheet1!O23^2+Sheet1!P23^2","v":0},{"$f":"K21*B2","v":0},{"$f":"(Sheet1!N23 + Sheet1!O23+Sheet1!P23)^2","v":0},0,0,0,0,"0",0]
[18,{"$f":"Sheet1!C24","v":" "},{"$f":"(Sheet1!N24*Sheet1!H49) + (Sheet1!O24*Sheet1!J49) + (Sheet1!P24*Sheet1!L49)","v":0},{"$f":"C22*B2","v":0},{"$f":"Sheet1!N24 + Sheet1!O24 + Sheet1!P24","v":0},{"$f":"Sheet1!H49+Sheet1!J49+Sheet1!L49","v":0},0,{"$f":"Sheet1!H49^2+Sheet1!J49^2+Sheet1!L49^2","v":0},{"$f":"H22*B2","v":0},{"$f":"(Sheet1!H49 + Sheet1!J49+Sheet1!L49)^2","v":0},{"$f":"Sheet1!N24^2+Sheet1!O24^2+Sheet1!P24^2","v":0},{"$f":"K22*B2","v":0},{"$f":"(Sheet1!N24 + Sheet1!O24+Sheet1!P24)^2","v":0},0,0,0,0,"0",0," "]
[19,{"$f":"Sheet1!C25","v":" "},{"$f":"(Sheet1!N25*Sheet1!H50) + (Sheet1!O25*Sheet1!J50) + (Sheet1!P25*Sheet1!L50)","v":0},{"$f":"C23*B2","v":0},{"$f":"Sheet1!N25 + Sheet1!O25 + Sheet1!P25","v":0},{"$f":"Sheet1!H50+Sheet1!J50+Sheet1!L50","v":0},0,{"$f":"Sheet1!H50^2+Sheet1!J50^2+Sheet1!L50^2","v":0},{"$f":"H23*B2","v":0},{"$f":"(Sheet1!H50 + Sheet1!J50+Sheet1!L50)^2","v":0},{"$f":"Sheet1!N25^2+Sheet1!O25^2+Sheet1!P25^2","v":0},{"$f":"K23*B2","v":0},{"$f":"(Sheet1!N25 + Sheet1!O25+Sheet1!P25)^2","v":0},0,0,0,0,"0",0]
[20,{"$f":"Sheet1!C26","v":" "},{"$f":"(Sheet1!N26*Sheet1!H51) + (Sheet1!O26*Sheet1!J51) + (Sheet1!P26*Sheet1!L51)","v":0},{"$f":"C24*B2","v":0},{"$f":"Sheet1!N26 + Sheet1!O26 + Sheet1!P26","v":0},{"$f":"Sheet1!H51+Sheet1!J51+Sheet1!L51","v":0},0,{"$f":"Sheet1!H51^2+Sheet1!J51^2+Sheet1!L51^2","v":0},{"$f":"H24*B2","v":0},{"$f":"(Sheet1!H51 + Sheet1!J51+Sheet1!L51)^2","v":0},{"$f":"Sheet1!N26^2+Sheet1!O26^2+Sheet1!P26^2","v":0},{"$f":"K24*B2","v":0},{"$f":"(Sheet1!N26 + Sheet1!O26+Sheet1!P26)^2","v":0},0,0,0,0,"0",0]
[]
[]
[null,null,null,null,null,null,null,null,null,null,null," "]
[null,null,null,null,null,null,null," "," ",null,null,null,null,null,null," "]
[]
[null,null,null,null,null,null," ",null,null," ",null,null,null,null,null,null,null,null,null," "]
[]
[null,null,null,null,null,null,null,null,null,null,null,null,null,null,null,null,null,null," "]
[]
[]
[]
[]
[]
[]
[]
[]
[]
[]
[]
[]
[]
[]
[]
[]
[]
[null,null," "]

{"sheet":"Sheet3","index":2,"n_rows":0,"n_cols":0,"rows_kept":0,"cut":false,"hidden":false,"merged":[]}